Home > Undefined Reference > Undefined Reference To Ns2 Error

Undefined Reference To Ns2 Error

asked 5 months ago viewed 56 times active 5 months ago Related 0C++ undefined reference in ns22Error in NS2.35 installation on fedora 170Compilation error while adding mp-olsr on ns 2.34 (Jiazi Issaraiyakul and E. ERROR: diffusion/diffusion.cc: In member function ‘void DiffusionAgent::MACprepare(Packet*, nsaddr_t, int, bool)':diffusion/diffusion.cc:404:26: error: ‘XmitFailedCallback' was not declared in this scopemake: *** [diffusion/diffusion.o] Error 1 SOLUTION: In file diffusion/diffusion.cc @@ -58,6 +58,8 @@ #include while compiling ns-all i none-2.1b9 in Solaris 8 in file ns/routing/route.h, remove the keyword 'inline': class RouteLogic : public TclObject { .... this contact form

V4HID Linux - Desktop 7 10-14-2009 10:30 AM glibc make error: undefined reference to `__sync_fetch_and_add_4' rendezvous123 Linux - Software 4 11-09-2008 07:18 PM make error/ undefined reference apljdi Linux - Newbie At a Linux command line, what do you get when you enter "g++ --version". Introduction to Network Simulator NS2 by T. For example: Code: INCLUDES = -I./includes Adv Reply June 19th, 2012 #4 dwhitney67 View Profile View Forum Posts Private Message Tolerant of Ubuntu Join Date Jun 2007 Location Maryland, US http://stackoverflow.com/questions/37397264/error-adding-a-olsr-to-ns2-35-undefined-reference-to-olsr-pktoffset

ERROR: dsr/dsragent.cc:1361:46: error: ‘XmitFailureCallback' was not declared in this scopedsr/dsragent.cc:1362:11: error: ‘XmitFlowFailureCallback' was not declared in this scopedsr/dsragent.cc:1379:31: error: ‘XmitFailureCallback' was not declared in this scope SOLUTION: In file dsr/dsragent.cc: @ Note that registered members see fewer ads, and ContentLink is completely disabled once you log in. Begginers do get trouble here as how to create, there is si... If you remove the library specifications from LDFLAGS and place them with LIB, then your build issues should be resolved.

Well, let’s boil them down to plain English, shall we?PolymorphismPolymorphism is the ability of C++ to invoke the same function with different implementation under different context. ERROR: tcp/tcp-sack-rh.cc: At global scope: tcp/tcp-sack-rh.cc:68:15: error: extra qualification ‘SackRHTcpAgent::' on member ‘newack' make: *** [tcp/tcp-sack-rh.o] Error 1 SOLUTION: The following changes in tcp/tcp-sack-rh.cc will work fine. I don't know what versions were afflicted, but I think they might have been older than 3.3. Search: Forum UNIX/Linux Programming undefined reference to 'functions' undefined reference to 'functions' Jun 19, 2012 at 9:53am UTC hasanalikhattak (6) i have added a module to ns2 and i am

networking network-protocols ns2 share|improve this question asked May 23 at 17:38 Hema 61 add a comment| 1 Answer 1 active oldest votes up vote 1 down vote HOWTO ns-2.35 + olsr ERROR: queue/pi.cc: In member function ‘virtual void PIQueue::trace(TracedVar*)':queue/pi.cc:316:36: error: invalid conversion from ‘const char*' to ‘char*'queue/pi.cc:317:36: error: invalid conversion from ‘const char*' to ‘char*'make: *** [queue/pi.o] Error 1 SOLUTION: Do the ns2 installation, problems and solutions on fedora One of the most easiest way to install ns2 is to download ns-allinone package. http://www.linuxquestions.org/questions/linux-software-2/ns2-error-in-make-command-undefined-reference-to-4175512394/ The libraries need to be specified after your object files, not before.

It is a mechanism to implement run-time method binding (a.k.a. I am getting this error. For details and our forum data attribution, retention and privacy policy, see here Welcome to the most active Linux Forum on the web. the error is still there.

  • Awesome Inc.
  • many thanks...
  • My name is Teerawat Issariyakul.
  • Difficult to understand, right?
  • I hope the contents in this website would help most people understand NS2 better.
  • The time now is 20:07.
  • An option that begins with a -L can be construed to be an LDFLAG, but not those with a lower-case l.
  • Remember replace "/your/path" by the folder where you have stored extracted the ns-2 file (For example, if your Linux account name is purple, and you have extracted the file to your
  • I thought that the 'something.o' file is the file that we create.
  • I doubt it, but sometimes it might make a difference if we are using different distributions.

Why does Deep Space Nine spin? You do not require any -I options when linking; I removed the following from the statement above: Code: -I./maser Adv Reply June 19th, 2012 #7 hasanalikhattak View Profile View Forum Quote: How much code is in your new files? It can have differing meaning // depending on whether the packet is SPM, ODATA, RDATA, NAK, or NCF.

Yes u're right. weblink Copy the ".cc" and ".h" files to the corresponding places in the new directories. (I just copy everything, then do "make clean".) I can't reproduce your problems or give any specific Quote: Originally Posted by newbie06 Dave, after all, I have managed to solve all the problem above. Browse other questions tagged networking network-protocols ns2 or ask your own question.

ERROR: queue/rio.cc: In member function ‘virtual void RIOQueue::trace(TracedVar*)':queue/rio.cc:565:35: error: invalid conversion from ‘const char*' to ‘char*'queue/rio.cc:566:38: error: invalid conversion from ‘const char*' to ‘char*'queue/rio.cc:567:39: error: invalid conversion from ‘const char*' to Chrome doesn't set cookies for domain "localhost" A recent problem has been popped up in chrome, since some time they don't allow user to set cookie for domain localhost. No new replies allowed. navigate here An option that begins with a -L can be construed to be an LDFLAG, but not those with a lower-case l.

Hmmm, perhaps I was not clear before... but after adding the library -lxml2 i was able to reduce some of the errors. ERROR:webcache/webtraf.cc: In member function ‘virtual int WebTrafPool::command(int, const char* const*)':webcache/webtraf.cc:415: error: ISO C++ forbids initialization in array newmake: *** [webcache/webtraf.o] Error 1 Solution In webcache/webtraf.cc at line number 362, modify as

Quote: Originally Posted by newbie06 ohh...there are so many files that I could not post it here.

inline int elements_in_level (int *addr, int level); ^^^^^^ remove it you may also encounter the error msg about 'friend ....', e.g. 'friend SRR' in file ns/queue/wss.h, in that case, change it I would appreciate any feedback or comment. Last edited by hasanalikhattak; June 19th, 2012 at 04:05 PM. Did you copy the entire ns installation tree somewhere else or are you doing your new stuff on top of the old stuff? (Either can be made to work, I think,

Notices Welcome to LinuxQuestions.org, a friendly and active Linux Community. Even though one of the errors has been corrected, more errors will be generated after re-compile. Partial sum of the harmonic series between two consecutive fibonacci numbers How strange is it (as an undergrad) to email a professor from another institution about possibly working in their lab? his comment is here Buy it from,
My Blog All of Tumblr Follow on Tumblr Follow me on Facebook Follow me on Twitter Keep yourself posted by EmailDelivered by FeedBurner RSS Feed Random Archive

ERROR: pgm/pgm-agent.cc: At global scope: pgm/pgm-agent.cc:278:8: error: extra qualification ‘PgmAgent::' on member ‘trace_event' pgm/pgm-agent.cc: In member function ‘void PgmAgent::handle_rdata(Packet*)': pgm/pgm-agent.cc:578:30: warning: deprecated conversion from string constant to ‘char*' pgm/pgm-agent.cc: In member Post your question in this forum. Free forum by Nabble Edit this page Network Simulator - 2 Pages Home Network Simulator v2 TCL script to demonstrate Message sending NAM Coding Generating Patch for NS-2 Xgraph Installation ERROR